Home > Gcc Error > Gcc Error Line Number

Gcc Error Line Number

Contents

How i can get number line of error from GCC ? more stack exchange communities company blog Stack Exchange Inbox Reputation and Badges sign up log in tour help Tour Start here for a quick overview of the site Help Center Detailed Join them; it only takes a minute: Sign up Why no line number for the g++ compile error? New postcard design added for the KDE End of Year 2014 Fundraising Campaign! http://meditationpc.com/gcc-error/gcc-error-line-number-format.php

more stack exchange communities company blog Stack Exchange Inbox Reputation and Badges sign up log in tour help Tour Start here for a quick overview of the site Help Center Detailed A book called "The Zone" Who lost to Glass Joe? This file is marked as being in error, so it cannot be used for binding purposes, but it does contain reasonably complete cross-reference information, and thus may be useful for use The message is just a warning. https://ubuntuforums.org/showthread.php?t=535287

Gcc Error Message Format

It is likely that you have put '/n' instead of '\n'. share|improve this answer answered Mar 19 '12 at 11:16 Anthony Faull 10.3k42657 1 I think I found what I want that matches up with your answer as well. share|improve this answer answered Jun 21 '11 at 23:38 Oliver Charlesworth 186k20371522 add a comment| Your Answer draft saved draft discarded Sign up or log in Sign up using Google The answer to this similar question may be of help: cc1plus: error: include: Value too large for defined data type when compiling with g++.

If it works, I will accept this. –Calmarius Aug 23 '13 at 16:45 1 Actually, dwarf is the problem -- he's using Ubuntu's old version of gdb that doesn't understand Typical output from compiling a package body p.adb might look like: Compiling: p.adb 1. Wednesday, July 09, 2014 8:20:00 PM Anonymous said... Note that `-gnatQ' has no effect if `-gnats' is specified, since ALI files are never generated if `-gnats' is set. current community chat Stack Overflow Meta Stack Overflow your communities

share|improve this answer edited Feb 2 '09 at 23:56 answered Feb 2 '09 at 23:49 cbrulak 5,649154688 Brulak is spot-on, if you're not getting a stack in gdb, you Colorgcc Blog Archive ► 2016 (7) ► November (1) ► October (1) ► August (1) ► July (1) ► May (1) ► March (1) ► February (1) ► 2015 (20) ► September Compiling the same program with the `-gnatf' switch yields e.adb:7:07: "V" is undefined e.adb:8:07: "V" is undefined e.adb:8:12: "V" is undefined e.adb:8:16: "V" is undefined e.adb:9:07: "V" is undefined e.adb:9:12: "V" http://stackoverflow.com/questions/8662069/debugging-with-gcc This switch tells GNAT to continue with semantic analysis even if syntax errors have been found.

Both parts of a surrogate pair (in UTF-16) should share a column. Ubuntu Ubuntu Insights Planet Ubuntu Activity Page Please read before SSO login Advanced Search Forum The Ubuntu Forum Community Ubuntu Specialised Support Development & Programming Programming Talk How to get number There are even special pieces of software called debuggers that have been written to help people hunt for run time errors. Why is onboard/inflight shopping still a thing?

Colorgcc

Logged scopaev Single posting newcomer Posts: 5 Re: Error Line number not being highlighted, with custom compiler setup « Reply #2 on: March 17, 2015, 04:47:00 am » Regex...shivers down spineThank Browse other questions tagged unicode compiler-errors or ask your own question. Gcc Error Message Format If the number of error messages reaches this limit, then a message is output and the compilation is abandoned. Gcc Options Ex.

This error message is usually accompanied by (Each undeclared identifier is reported only once for each function it appears in.). this content If you get one of these errors check to make sure that you have written the function and that you have spelled the function name correctly. Have we attempted to experimentally confirm gravitational time dilation? Amongst them i got a new keyboard to replace ...

share|improve this answer answered Feb 2 '09 at 23:50 SoapBox 16.3k13375 add a comment| up vote 1 down vote The No stack problem seems to happen when the program exit successfully. You have called a function and you did not send it enough arguments. End of my proposal. http://meditationpc.com/gcc-error/gcc-error-message-line-number-convention.php This means that you have not followed the basic rules of C.

Program template for printing *any* string A question about subsets of plane Display a chain of little mountains with an odd number on the top of it! Helpful suggestion debugging gcc gdb segmentation-fault share|improve this question edited Oct 6 '13 at 23:52 Kamil Slowikowski 338313 asked Feb 2 '09 at 23:41 Rohit 94241527 can you post If the program is multi-function and/or multi-file, then each different function/file containing errors will be listed separately.

Brief format messages are written to stderr (the standard error file) and have the following form: e.adb:3:04: Incorrect spelling of keyword "function" e.adb:4:20: ";" should be "is" The first integer after

Shortest code to throw SIGILL How to compose flowering plants? Check your program for a place where you started a string but forgot to put the closing quotation mark. After compiling, my "Build Log" Tab does not automatically switch to the "Build messages" Tab. According to their web it finds: Use afte...

Today is Biblical Magi day in Spain, so i got some nice presents. Can creatures non-native to the prime material plane become undead? There is NO WARRANTY, to the extent permitted by law. check over here Pragmatically, I would output whatever is more convenient in the programming language that you are using.

up vote 1 down vote favorite I'm trying to compile a 64bit C++ app on Linux using g++. For example, prog.c:3: warning: unknown escape sequence `\z' indicates that a problem was encountered at line 3 of the program file prog.c. So we will go over some common gcc error messages, what they mean, and how to fix them. asked 4 years ago viewed 839 times active 4 years ago Related 164Using GCC to produce readable assembly?2006Improve INSERT-per-second performance of SQLite?1gcc not generating debug files99GCC compile error with >2 GB

make: *** [Linker.o] Error 1 linux 64bit g++ share|improve this question asked Jun 21 '11 at 23:33 Jeff 1,3961530 2 possible duplicate of cc1plus: error: include: Value too large for C is also case-sensitive, so that var and Var are considered to be different variables. null | >>> missing ";" 5. procedure a is 3.

How safe are Wi-Fi Hotspots?